天空之城

您当前位置>>首页>>其它>>操作系统>>lamp编译出错问题解决

lamp编译出错问题解决

来源:天空之城 - My Site   时间:2014-04-14 16:14:47   编辑:administrator   阅读数:229

[导读]在编译安装lamp环境时出现的几个问题,当然有时候不同系统不同版本的软件的安装编译都不一定相同,很多人都应该知道,其实很多问题都有着一定的联系,这里某个地方出了问题,在其他地方安装也会有着影响,当然如果一些编译参数设置不一样,其中修改调试也要相应的修改;另外在不同情况下,有些问题没有一个准确唯一的解决方法,这就要靠你查阅资料的能力了;

lamp编译出错问题解决-文档下载

1.gcc,gcc-c++等这些需要的服务,如出现缺少不能安装,安装即可

2.出现/usr/local/lib/libz.a: could not read symbols: Bad value

在编译gd库make步骤时出现

/usr/bin/ld: /usr/local/lib/libz.a(compress.o): relocation R_X86_64_32

against `a local symbol' can not be used when making a shared object;

recompile with -fPIC (这里提示重新编译with -fPIC<重新编译zlib>)

/usr/local/lib/libz.a: could not read symbols: Bad value

这种情况一般为64位系统出现,可以重新编译zlib,使用64位元编译方法:

cd zlib-1.2.3

CFLAGS='-O3 -fPIC' ./configure

make

make install

make clean

用源代码编译安装其他一些软件时如果出现类似的错误也可以用这种方法解决;

 

3. mysql启动时报错 ERROR! Manager of pid-file quit without updating file

 

运行:/usr/local/mysql/bin/mysql_install_db –user=mysql然后启动即可(其他类似也可以使用)

 

4. 编译php时出现:configure: error: Problem with libjpeg.(a|so). Please check config.log for more information.

方法:

加上--with-jpeg-dir=/usr/lib(原来--with-jpeg-dir=/usr/local/jpeg6源代码安装)

如果出现configure: error: libjpeg.(a|so) not found.

使用命令:cp  -frp /usr/lib64/libjpeg.* /usr/lib/            //复制jpeg相关到/usr/lib目录

 

注:如果出现哪个服务或组件(软件)找不到或未配置等问题,确定已配置好编译参数,则多为该软件安装出问题(或者未安装)

比如以上出现jpeg相关问题(重新编译安装jpeg试试)(下一页)

5.编译jpeg出现:

./libtool --mode=compile gcc -O2  -I. -c ./jcapimin.c

make: ./libtool: Command not found

make: *** [jcapimin.lo] Error 127

错误分析:由于libtool版本过低导致的,重新下载新版本的libtool以默认方式安装(可用yum安装)

下载地址:http://url.cn/PrHW3t

# tar zxvf libtool-1.5.26.tar.gz
# cd libtool-1.5.26
# ./configure
# make
# make install

切记:

然后进入jpeg-6b的源码目录,然后执行以下步骤,切记!
# cp /usr/local/share/libtool/config.sub ./
# cp /usr/local/share/libtool/config.guess ./
# ./configure --prefix=/usr/local/jpeg6/ --enable-shared --enable-static
# make
# make install

也就是把 libtool里面的两个配置文件拿来覆盖掉jpeg-6b目录下的对应文件

然后编译jpeg终于搞定

 

 

6. 编译gd-2.0.35.tar.gz时报错:gd_png.c:16:53: error: png.h: No such file or directory

gcc -DHAVE_CONFIG_H -I. -I. -I. -I/usr/local/freetype/include/freetype2 -I/usr/local/freetype/include -I/usr/local/freetype/include -I/usr/local/jpeg/include -g -O2 -MT gd_png.lo -MD -MP -MF .deps/gd_png.Tpo -c gd_png.c -fPIC -DPIC -o .libs/gd_png.o
gd_png.c:16:53: error: png.h: No such file or directory
gd_png.c:47: error: expected specifier-qualifier-list before ‘jmp_buf’
gd_png.c:54: error: expected ‘)’ before ‘png_ptr’
gd_png.c:82: error: expected ‘)’ before ‘png_ptr’
gd_png.c:92: error: expected ‘)’ before ‘png_ptr’

 

解决办法:

vi gd_png.c

#include “png.h”             
替换成:
#include “/usr/local/libpng/include/png.h”             
然后再make就可以了

注:include“”双引号里包含的是libpng安装的路径里的include文件夹里的png.h文件

lamp编译出错问题解决
原文地址:

上一篇:htaccess文件用法收集整理
下一篇:php简单实现vc模式

    相关文章

    更多»
      just do it
      天空之城天空之城